Target
Trace amine-associated receptor 1
Ligand
BDBM422652
Substrate
Meas. Tech.
Human TAAR1 assay
EC50
58.5±n/a nM
Citation
 Galley, GHoener, MNorcross, RPflieger, P Morpholine derivative US Patent  US10508107 Publication Date 12/17/2019 
Target
Name:
Trace amine-associated receptor 1
Synonyms:
TA1 TAAR1_HUMAN TRAR1 | trace amine-associated receptor 1
Type:
PROTEIN
Mol. Mass.:
39107.47
Organism:
Homo sapiens (Human)
Description:
ChEMBL_792734
Residue:
339
  
Inhibitor
Name:
BDBM422652
Synonyms:
5-Ethyl-4-methyl-N-[4-[(2S)-morpholin-2-yl]phenyl]-1H-pyrazole-3-carboxamide US11312711, Example 1
Type:
Small organic molecule
Emp. Form.:
C17H22N4O2
Mol. Mass.:
314.3822
SMILES:
CCc1[nH]nc(C(=O)Nc2ccc(cc2)[C@H]2CNCCO2)c1C
: