Target
Casein kinase I isoform delta
Ligand
BDBM6870
Substrate
CK1 Peptide Substrate
Meas. Tech.
Kinase Inhibition Assay
IC50
570±n/a nM
Citation
 Lin, RConnolly, PJHuang, SWetter, SKLu, YMurray, WVEmanuel, SLGruninger, RHFuentes-Pesquera, ARRugg, CAMiddleton, SAJolliffe, LK 1-Acyl-1H-[1,2,4]triazole-3,5-diamine analogues as novel and potent anticancer cyclin-dependent kinase inhibitors: synthesis and evaluation of biological activities. J Med Chem 48:4208-11 (2005)  
Target
Name:
Casein kinase I isoform delta
Synonyms:
CK1, delta Casein kinase I delta Csnk1d KC1D_RAT | casein kinase 1, delta
Type:
Enzyme
Mol. Mass.:
47342.73
Organism:
Rattus norvegicus (rat)
Description:
Q06486
Residue:
415
  
Inhibitor
Name:
BDBM6870
Synonyms:
1-Acyl-1H-[1,2,4]triazole-3,5-diamine Analogue 3f 4-[[5-Amino-1-[(3-methyl-2-thienyl)carbonyl]-1H-1,2,4-triazol-3-yl]amino]-benzenesulfonamide
Type:
Small organic molecule
Emp. Form.:
C14H14N6O3S2
Mol. Mass.:
378.429
SMILES:
Cc1ccsc1C(=O)n1nc(Nc2ccc(cc2)S(N)(=O)=O)nc1N
:
Substrate
Name:
CK1 Peptide Substrate
Synonyms:
Type:
Peptide
Mol. Mass.:
3083.59
Organism:
Description:
Residue:
28