Target
Proto-oncogene tyrosine-protein kinase Src
Ligand
BDBM50298225
Substrate
Meas. Tech.
luminescent kinase assay
IC50
2200±n/a nM
Citation
 Van Voorhis, WCHol, WGLarson, ETMaly, DJMerritt, EOjo, KK Compositions and methods for treating toxoplasmosis, cryptosporidiosis, and other apicomplexan protozoan related diseases US Patent  US10544104 Publication Date 1/28/2020 
Target
Name:
Proto-oncogene tyrosine-protein kinase Src
Synonyms:
Calmodulin/Proto-oncogene tyrosine-protein kinase Src Proto-oncogene c-Src SRC SRC_HUMAN V-src sarcoma (Schmidt-Ruppin A-2) viral oncogene homolog (avian) p60-Src | pp60c-src
Type:
Protein
Mol. Mass.:
59838.60
Organism:
Homo sapiens (Human)
Description:
P12931
Residue:
536
  
Inhibitor
Name:
BDBM50298225
Synonyms:
CHEMBL2069955 NM-PP1 US11247972, Compound 5d | US9765037, Compound 5d
Type:
Small organic molecule
Emp. Form.:
C20H21N5
Mol. Mass.:
331.4142
SMILES:
CC(C)(C)n1nc(Cc2cccc3ccccc23)c2c(N)ncnc12
: