Target
Tyrosine-protein kinase ABL1
Ligand
BDBM341808
Substrate
Meas. Tech.
luminescent kinase assay
IC50
7845±n/a nM
Citation
 Van Voorhis, WCHol, WGLarson, ETMaly, DJMerritt, EOjo, KK Compositions and methods for treating toxoplasmosis, cryptosporidiosis, and other apicomplexan protozoan related diseases US Patent  US10544104 Publication Date 1/28/2020 
Target
Name:
Tyrosine-protein kinase ABL1
Synonyms:
ABL ABL1_HUMAN JTK7 Proto-oncogene tyrosine-protein kinase ABL1 Tyrosine-protein kinase ABL V-abl Abelson murine leukemia viral oncogene homolog 1 p150 | tyrosine-protein kinase ABL1 isoform a
Type:
Enzyme
Mol. Mass.:
122897.30
Organism:
Homo sapiens (Human)
Description:
P00519
Residue:
1130
  
Inhibitor
Name:
BDBM341808
Synonyms:
US10544104, Compound 124 | US9765037, Compound 124
Type:
Small organic molecule
Emp. Form.:
C26H32N6O
Mol. Mass.:
444.5719
SMILES:
CC(C)COc1ccc2cc(ccc2c1)-c1nn(CC2CCN(C)CC2)c2ncnc(N)c12
: