Target
Tyrosine-protein kinase JAK3
Ligand
BDBM100349
Substrate
Meas. Tech.
Kinase Assay
Kd
3.00±n/a nM
Citation
 Bauer, SMJia, ZJMehrotra, MSong, YXu, QHuang, WVenkataramani, CRose, JWPandey, A Inhibitors of protein kinases US Patent  US10533001 Publication Date 1/14/2020 
Target
Name:
Tyrosine-protein kinase JAK3
Synonyms:
JAK-3 JAK3_HUMAN Janus kinase 3 (JAK3) L-JAK | Leukocyte janus kinase
Type:
Protein
Mol. Mass.:
125111.08
Organism:
Homo sapiens (Human)
Description:
P52333
Residue:
1124
  
Inhibitor
Name:
BDBM100349
Synonyms:
US10533001, Example Table 9a.2 US8501944, 371 | US9868729, Example 207
Type:
Small organic molecule
Emp. Form.:
C21H27N7O2
Mol. Mass.:
409.4848
SMILES:
CNC(=O)[C@H]1CCCN(C1)c1ccc(Nc2ncc(C(N)=O)c(NC3CC3)n2)cc1
: