Target
Cyclin-dependent kinase 2/G1/S-specific cyclin-E1
Ligand
BDBM6921
Substrate
GST-Rb fusion protein
Meas. Tech.
Kinase Inhibition Assay
pH
7.6±n/a
Temperature
295.15±n/a K
IC50
36±n/a nM
Citation
 Nugiel, DAVidwans, ADzierba, CD Parallel synthesis of acylsemicarbazide libraries: preparation of potent cyclin dependent kinase (cdk) inhibitors. Bioorg Med Chem Lett 14:5489-91 (2004)  
Target
Name:
Cyclin-dependent kinase 2/G1/S-specific cyclin-E1
Synonyms:
CDK2/CycE CDK2/E Cyclin-Dependent Kinase 2 (CDK2) Cyclin-dependent kinase 2/cyclin E1
Type:
Protein
Mol. Mass.:
Description:
Components:
This complex has 2 components.
Component 1
Name:
Cyclin-dependent kinase 2
Synonyms:
CDK2 CDK2_HUMAN Cell division protein kinase 2 Protein cereblon/Cyclin-dependent kinase 2 | p33 protein kinase
Type:
Enzyme Subunit
Mol. Mass.:
33938.17
Organism:
Homo sapiens (Human)
Description:
P24941
Residue:
298
  
Component 2
Name:
G1/S-specific cyclin-E1
Synonyms:
CCNE CCNE1_HUMAN
Type:
Enzyme Subunit
Mol. Mass.:
47073.17
Organism:
Homo sapiens (Human)
Description:
Residue:
410
  
Inhibitor
Name:
BDBM6921
Synonyms:
2,5-dichloro-N-({[3-(4-methoxyphenyl)-4-oxo-2H,4H-indeno[1,2-c]pyrazol-5-yl]carbamoyl}amino)benzamide | acylsemicarbazide deriv. 3i
Type:
Small organic molecule
Emp. Form.:
C25H17Cl2N5O4
Mol. Mass.:
522.34
SMILES:
COc1ccc(cc1)-c1n[nH]c2-c3cccc(NC(=O)NNC(=O)c4cc(Cl)ccc4Cl)c3C(=O)c12
:
Substrate
Name:
GST-Rb fusion protein
Synonyms:
Glutathione S-transferase (GST)-retinoblastoma (Rb) fusion RB1 Rb | retinoblastoma
Type:
Other Protein Type
Mol. Mass.:
106410.17
Organism:
Homo sapiens (Human)
Description:
GST-60 kDa Rb fusion protein (comprising amino acids 378 to 928 of retinoblastoma)
Residue:
928