Target
Cyclin-dependent kinase 4/G1/S-specific cyclin-D1
Ligand
BDBM6921
Substrate
GST-Rb fusion protein
Meas. Tech.
Kinase Inhibition Assay
IC50
28±n/a nM
Citation
 Nugiel, DAVidwans, ADzierba, CD Parallel synthesis of acylsemicarbazide libraries: preparation of potent cyclin dependent kinase (cdk) inhibitors. Bioorg Med Chem Lett 14:5489-91 (2004)  
Target
Name:
Cyclin-dependent kinase 4/G1/S-specific cyclin-D1
Synonyms:
CDK4/CycD CDK4/Cyclin D1 Cyclin-Dependent Kinase 4 (CDK4) Cyclin-dependent kinase 4/G1/S-specific cyclin D1 | Cyclin-dependent kinase 4/cyclin D1
Type:
Protein Complex
Mol. Mass.:
Description:
CDK4/D1 complexes were purified from insect cells co-infected with baculovirus vectors containing each of the components.
Components:
This complex has 2 components.
Component 1
Name:
Cyclin-dependent kinase 4
Synonyms:
CDK4 Cell division protein kinase 4 PSK-J3
Type:
Enzyme Subunit
Mol. Mass.:
33731.96
Organism:
Homo sapiens (Human)
Description:
P11802
Residue:
303
  
Component 2
Name:
G1/S-specific cyclin-D1
Synonyms:
B-cell lymphoma 1 protein BCL-1 oncogene CCND1 PRAD1 | PRAD1 oncogene
Type:
Enzyme Subunit
Mol. Mass.:
33717.70
Organism:
Homo sapiens (Human)
Description:
Residue:
295
  
Inhibitor
Name:
BDBM6921
Synonyms:
2,5-dichloro-N-({[3-(4-methoxyphenyl)-4-oxo-2H,4H-indeno[1,2-c]pyrazol-5-yl]carbamoyl}amino)benzamide | acylsemicarbazide deriv. 3i
Type:
Small organic molecule
Emp. Form.:
C25H17Cl2N5O4
Mol. Mass.:
522.34
SMILES:
COc1ccc(cc1)-c1n[nH]c2-c3cccc(NC(=O)NNC(=O)c4cc(Cl)ccc4Cl)c3C(=O)c12
:
Substrate
Name:
GST-Rb fusion protein
Synonyms:
Glutathione S-transferase (GST)-retinoblastoma (Rb) fusion RB1 Rb | retinoblastoma
Type:
Other Protein Type
Mol. Mass.:
106410.17
Organism:
Homo sapiens (Human)
Description:
GST-60 kDa Rb fusion protein (comprising amino acids 378 to 928 of retinoblastoma)
Residue:
928