Target
Proto-oncogene tyrosine-protein kinase receptor Ret
Ligand
BDBM21
Substrate
Meas. Tech.
Measurement of Biochemical Activity of Compounds
IC50
4.00±n/a nM
Citation
 Brubaker, JDKim, JLWilson, KJWilson, DDiPietro, LV Inhibitors of RET US Patent  US10584114 Publication Date 3/10/2020 
Target
Name:
Proto-oncogene tyrosine-protein kinase receptor Ret
Synonyms:
CDHF12 Cadherin family member 12 Proto-oncogene c-Ret RET51 Tyrosine-protein kinase Ret (RET)
Type:
Protein
Mol. Mass.:
124318.29
Organism:
Homo sapiens (Human)
Description:
P07949
Residue:
1114
  
Inhibitor
Name:
BDBM21
Synonyms:
CHEMBL24828 VANDETANIB ZD6474 | cid_3081361
Type:
Emp. Form.:
C22H24BrFN4O2
Mol. Mass.:
475.354
SMILES:
COc1cc2c(Nc3ccc(Br)cc3F)ncnc2cc1OCC1CCN(C)CC1
: