Target
Tyrosine-protein kinase JAK1
Ligand
BDBM374722
Substrate
Meas. Tech.
Kinase Binding Assays
Kd
65.0±n/a nM
Citation
 Cui, JJLi, YRogers, EWZhai, D Diaryl macrocycles as modulators of protein kinases US Patent  US10618912 Publication Date 4/14/2020 
Target
Name:
Tyrosine-protein kinase JAK1
Synonyms:
JAK-1 JAK1A JAK1_HUMAN Janus kinase 1 (JAK1) | Janus kinase 1 JAK1
Type:
Protein
Mol. Mass.:
133293.73
Organism:
Homo sapiens (Human)
Description:
P23458
Residue:
1154
  
Inhibitor
Name:
BDBM374722
Synonyms:
11-fluoro-13-methyl-6,7,13,14-tetrahydro-1,15- ethenopyrazolo[4,3- f][1,4,8,10]benzoxatriazacyclotridecin-4(5H)-one US10618912, Example 51
Type:
Small organic molecule
Emp. Form.:
C17H16FN5O2
Mol. Mass.:
341.3396
SMILES:
CC1Nc2ccn3ncc(C(=O)NCCOc4ccc(F)cc14)c3n2
: