Target
Tyrosine-protein kinase JAK3
Ligand
BDBM374722
Substrate
Meas. Tech.
Kinase Binding Assays
Kd
4.30±n/a nM
Citation
 Cui, JJLi, YRogers, EWZhai, D Diaryl macrocycles as modulators of protein kinases US Patent  US10618912 Publication Date 4/14/2020 
Target
Name:
Tyrosine-protein kinase JAK3
Synonyms:
JAK-3 JAK3_HUMAN Janus kinase 3 (JAK3) L-JAK | Leukocyte janus kinase
Type:
Protein
Mol. Mass.:
125111.08
Organism:
Homo sapiens (Human)
Description:
P52333
Residue:
1124
  
Inhibitor
Name:
BDBM374722
Synonyms:
11-fluoro-13-methyl-6,7,13,14-tetrahydro-1,15- ethenopyrazolo[4,3- f][1,4,8,10]benzoxatriazacyclotridecin-4(5H)-one US10618912, Example 51
Type:
Small organic molecule
Emp. Form.:
C17H16FN5O2
Mol. Mass.:
341.3396
SMILES:
CC1Nc2ccn3ncc(C(=O)NCCOc4ccc(F)cc14)c3n2
: