Target
Arginase-1
Ligand
BDBM290392
Substrate
Meas. Tech.
Inhibition Assay
IC50
1000±n/a nM
Citation
 Van Zandt, MJagdmann, GE Arginase inhibitors as therapeutics US Patent  US10603330 Publication Date 3/31/2020 
Target
Name:
Arginase-1
Synonyms:
ARG1 Liver-type arginase | Type I arginase
Type:
PROTEIN
Mol. Mass.:
34737.53
Organism:
Homo sapiens (Human)
Description:
ChEMBL_978893
Residue:
322
  
Inhibitor
Name:
BDBM290392
Synonyms:
(3R,4S)-3-amino-4-(3-boronopropyl)-1-(piperidin-3-yl)pyrrolidine- 3-carboxylic acid US10603330, Example 28 | US11389464, Example 28
Type:
Small organic molecule
Emp. Form.:
C13H26BN3O4
Mol. Mass.:
299.174
SMILES:
N[C@]1(CN(C[C@@H]1CCCB(O)O)C1CCCNC1)C(O)=O
: