Target
Sodium/potassium-transporting ATPase subunit alpha-2/beta-2
Ligand
BDBM444996
Substrate
Meas. Tech.
Selective Inhibition Assays of Isolated Na,K-ATPase
Ki
33.5±11.9 nM
Citation
 Karlish, SJKatz, ATal, DMMarcovich, A Selective inhibitors of Alpha2-containing isoforms of Na,K-ATPase and use thereof for reduction of intraocular pressure US Patent  US10668094 Publication Date 6/2/2020 
Target
Name:
Sodium/potassium-transporting ATPase subunit alpha-2/beta-2
Synonyms:
Na,K-ATPase alpha2beta2
Type:
Protein
Mol. Mass.:
Description:
Components:
This complex has 2 components.
Component 1
Name:
Sodium/potassium-transporting ATPase subunit alpha-2
Synonyms:
AT1A2_HUMAN KIAA0778 | Na,K-ATPase isoform alpha-2 (α2)
Type:
Enzyme
Mol. Mass.:
112253.12
Organism:
Homo sapiens (Human)
Description:
P50993
Residue:
1020
  
Component 2
Name:
Sodium/potassium-transporting ATPase subunit beta-2
Synonyms:
AMOG ATP1B2 Sodium/potassium-dependent ATPase subunit beta-2
Type:
Protein
Mol. Mass.:
33373.25
Organism:
Human
Description:
P14415
Residue:
290
  
Inhibitor
Name:
BDBM444996
Synonyms:
US10668094, Compound DcPe-(cyclic)
Type:
Small organic molecule
Emp. Form.:
C46H73NO12
Mol. Mass.:
832.0713
SMILES:
C[C@@H]1O[C@H](C[C@H](O)[C@@H]1O[C@H]1C[C@H](O)[C@H](OC2CCN(CC(C)O2)C2CCCC2)[C@H](C)O1)O[C@H]1CC[C@@]2(C)C(CCC3C2C[C@H](O)[C@]2(C)[C@H](CC[C@]32O)C2=CC(=O)OC2)C1
: