Target
Sodium/potassium-transporting ATPase subunit alpha-2/beta-2
Ligand
BDBM46356
Substrate
Meas. Tech.
Selective Inhibition Assays of Isolated Na,K-ATPase
Ki
40.7±6.7 nM
Citation
 Karlish, SJKatz, ATal, DMMarcovich, A Selective inhibitors of Alpha2-containing isoforms of Na,K-ATPase and use thereof for reduction of intraocular pressure US Patent  US10668094 Publication Date 6/2/2020 
Target
Name:
Sodium/potassium-transporting ATPase subunit alpha-2/beta-2
Synonyms:
Na,K-ATPase alpha2beta2
Type:
Protein
Mol. Mass.:
Description:
Components:
This complex has 2 components.
Component 1
Name:
Sodium/potassium-transporting ATPase subunit alpha-2
Synonyms:
AT1A2_HUMAN KIAA0778 | Na,K-ATPase isoform alpha-2 (α2)
Type:
Enzyme
Mol. Mass.:
112253.12
Organism:
Homo sapiens (Human)
Description:
P50993
Residue:
1020
  
Component 2
Name:
Sodium/potassium-transporting ATPase subunit beta-2
Synonyms:
AMOG ATP1B2 Sodium/potassium-dependent ATPase subunit beta-2
Type:
Protein
Mol. Mass.:
33373.25
Organism:
Human
Description:
P14415
Residue:
290
  
Inhibitor
Name:
BDBM46356
Synonyms:
DIGITOXIN SMR000058529 cid_441207
Type:
Small organic molecule
Emp. Form.:
C41H64O13
Mol. Mass.:
764.9391
SMILES:
C[C@H]1O[C@H](C[C@H](O)[C@@H]1O)O[C@H]1[C@@H](O)C[C@H](O[C@H]2[C@@H](O)C[C@H](O[C@H]3CC[C@@]4(C)[C@H](CC[C@@H]5[C@@H]4CC[C@]4(C)[C@H](CC[C@]54O)C4=CC(=O)OC4)C3)O[C@@H]2C)O[C@@H]1C
: