Target
Vascular endothelial growth factor receptor 1
Ligand
BDBM445240
Substrate
Meas. Tech.
VEGFR1 Enzyme Inhibition
Ki
29.6±n/a nM
Citation
 Walters, IBirch, LCollingwood, SPStevenson, CS Indole derivatives and their use as protein kinase inhibitors US Patent  US10669235 Publication Date 6/2/2020 
Target
Name:
Vascular endothelial growth factor receptor 1
Synonyms:
FLT FRT Fms-like tyrosine kinase 1 Tyrosine-protein kinase FRT VEGFR-1 VGFR1_HUMAN Vascular endothelial growth factor receptor 1 (FLT1) Vascular endothelial growth factor receptor 1 and 2 (Flt-1 and KDR) Vascular permeability factor receptor vascular endothelial growth factor/vascular permeability factor receptor
Type:
Receptor Tyrosine Kinase
Mol. Mass.:
150800.23
Organism:
Homo sapiens (Human)
Description:
P17948
Residue:
1338
  
Inhibitor
Name:
BDBM445240
Synonyms:
US10669235, Example 31 | US11208381, Example 31
Type:
Small organic molecule
Emp. Form.:
C35H39N5O5
Mol. Mass.:
609.7147
SMILES:
COC(=O)c1cc2NC(=O)\C(=C(/Nc3ccc(cc3)C(=O)N3CCC(CC3)C(=O)NCCN(C)C)c3ccccc3)c2cc1C
: