Target
Vascular endothelial growth factor receptor 1
Ligand
BDBM445246
Substrate
Meas. Tech.
VEGFR1 Enzyme Inhibition
Ki
45.4±n/a nM
Citation
 Walters, IBirch, LCollingwood, SPStevenson, CS Indole derivatives and their use as protein kinase inhibitors US Patent  US10669235 Publication Date 6/2/2020 
Target
Name:
Vascular endothelial growth factor receptor 1
Synonyms:
FLT FRT Fms-like tyrosine kinase 1 Tyrosine-protein kinase FRT VEGFR-1 VGFR1_HUMAN Vascular endothelial growth factor receptor 1 (FLT1) Vascular endothelial growth factor receptor 1 and 2 (Flt-1 and KDR) Vascular permeability factor receptor vascular endothelial growth factor/vascular permeability factor receptor
Type:
Receptor Tyrosine Kinase
Mol. Mass.:
150800.23
Organism:
Homo sapiens (Human)
Description:
P17948
Residue:
1338
  
Inhibitor
Name:
BDBM445246
Synonyms:
US10669235, Example 37 | US11208381, Example 37
Type:
Small organic molecule
Emp. Form.:
C35H38N4O5
Mol. Mass.:
594.7
SMILES:
COC(=O)c1cc2NC(=O)\C(=C(/Nc3ccc(cc3)C(=O)N3CCC(O)(CN4CCCC4)CC3)c3ccccc3)c2cc1C
: