Target
Vascular endothelial growth factor receptor 1
Ligand
BDBM445222
Substrate
Meas. Tech.
VEGFR1 Enzyme Inhibition
Ki
41.6±n/a nM
Citation
 Walters, IBirch, LCollingwood, SPStevenson, CS Indole derivatives and their use as protein kinase inhibitors US Patent  US10669235 Publication Date 6/2/2020 
Target
Name:
Vascular endothelial growth factor receptor 1
Synonyms:
FLT FRT Fms-like tyrosine kinase 1 Tyrosine-protein kinase FRT VEGFR-1 VGFR1_HUMAN Vascular endothelial growth factor receptor 1 (FLT1) Vascular endothelial growth factor receptor 1 and 2 (Flt-1 and KDR) Vascular permeability factor receptor vascular endothelial growth factor/vascular permeability factor receptor
Type:
Receptor Tyrosine Kinase
Mol. Mass.:
150800.23
Organism:
Homo sapiens (Human)
Description:
P17948
Residue:
1338
  
Inhibitor
Name:
BDBM445222
Synonyms:
US10669235, Example 13 US11208381, Example 49
Type:
Small organic molecule
Emp. Form.:
C32H34N4O5
Mol. Mass.:
554.6362
SMILES:
COC(=O)c1cc2NC(=O)\C(=C(/Nc3ccc(cc3)C(=O)NC3CCN(CCO)CC3)c3ccccc3)c2cc1C
: