Target
Beta-secretase 1
Ligand
BDBM445520
Substrate
Meas. Tech.
Inhibition Assay
IC50
10.00±n/a nM
Citation
 Badiger, SChebrolu, MHurth, KJacquier, SLueoend, RMMachauer, RRueeger, HTintelnot-Blomley, MVeenstra, SJVoegtle, M Heterocyclic derivatives and their use in the treatment of neurological disorders US Patent  US10683287 Publication Date 6/16/2020 
Target
Name:
Beta-secretase 1
Synonyms:
ASP2 Aspartyl protease 2 BACE1 Beta-secretase (BACE) Beta-secretase 1 (BACE 1) Beta-secretase 1 (BACE1) Beta-site amyloid precursor protein cleaving enzyme 1 Memapsin-2 beta-Secretase (BACE-1) | beta-Secretase (BACE1)
Type:
Protein
Mol. Mass.:
55755.10
Organism:
Homo sapiens (Human)
Description:
P56817
Residue:
501
  
Inhibitor
Name:
BDBM445520
Synonyms:
US10683287, Example 46
Type:
Small organic molecule
Emp. Form.:
C18H18F6N6O2
Mol. Mass.:
464.3649
SMILES:
Cc1cn(nc1C(=O)Nc1ccc(F)c(n1)[C@]1(C)CO[C@](C)(C(N)=N1)C(F)(F)F)C(F)F
: