Target
Tryptophan 5-hydroxylase 2
Ligand
BDBM445671
Substrate
Meas. Tech.
In Vitro Enzyme Activity Assay
IC50
20.0±1 nM
Citation
 Bader, MSpecker, EMatthes, SSchütz, AMallow, KGrohmann, MNazaré, M Xanthine derivatives, their use as a medicament, and pharmaceutical preparations comprising the same US Patent  US10683309 Publication Date 6/16/2020 
Target
Name:
Tryptophan 5-hydroxylase 2
Synonyms:
NTPH TPH2_HUMAN
Type:
PROTEIN
Mol. Mass.:
56055.12
Organism:
Homo sapiens (Human)
Description:
ChEMBL_487490
Residue:
490
  
Inhibitor
Name:
BDBM445671
Synonyms:
Ex. 9/KM-06-89/(I-9) US11028104, Example 9
Type:
Small organic molecule
Emp. Form.:
C26H22N8O2
Mol. Mass.:
478.5053
SMILES:
CCn1c2nc(Cc3cn4ccccc4n3)n(Cc3ccc(cc3)-c3ncccn3)c2c(=O)[nH]c1=O
: