Target
Tyrosine-protein kinase Fyn
Ligand
BDBM446853
Substrate
Meas. Tech.
ADP-Glo Kinase Assay
IC50
458±n/a nM
Citation
 Lau, WC Methods, compositions, and uses of novel Fyn kinase inhibitors US Patent  US10688093 Publication Date 6/23/2020 
Target
Name:
Tyrosine-protein kinase Fyn
Synonyms:
FYN Proto-oncogene Syn SLK Src-like kinase | p59-Fyn
Type:
Enzyme
Mol. Mass.:
60762.21
Organism:
Homo sapiens (Human)
Description:
P06241
Residue:
537
  
Inhibitor
Name:
BDBM446853
Synonyms:
4-[6-amino-5- (3,4,5-trimethoxy- phenyl)-3- pyridyl]benzamide US10688093, Compound BF000312540 (382_0087_0346) | US11701353, Compound 382_0087_0346
Type:
Small organic molecule
Emp. Form.:
C21H21N3O4
Mol. Mass.:
379.4091
SMILES:
COc1cc(cc(OC)c1OC)-c1cc(cnc1N)-c1ccc(cc1)C(N)=O
: