Target
Tyrosine-protein kinase Fyn
Ligand
BDBM447338
Substrate
Meas. Tech.
ADP-Glo Kinase Assay
IC50
214±n/a nM
Citation
 Lau, WC Methods, compositions, and uses of novel Fyn kinase inhibitors US Patent  US10688093 Publication Date 6/23/2020 
Target
Name:
Tyrosine-protein kinase Fyn
Synonyms:
FYN Proto-oncogene Syn SLK Src-like kinase | p59-Fyn
Type:
Enzyme
Mol. Mass.:
60762.21
Organism:
Homo sapiens (Human)
Description:
P06241
Residue:
537
  
Inhibitor
Name:
BDBM447338
Synonyms:
US10688093, Compound BF000313038 | US11701353, Compound BF000313038
Type:
Small organic molecule
Emp. Form.:
C19H17N3O3
Mol. Mass.:
335.3566
SMILES:
COc1cc(ccc1O)-c1cc(cnc1N)-c1ccc(cc1)C(N)=O
: