Target
Metabotropic glutamate receptor 3
Ligand
BDBM446828
Substrate
Meas. Tech.
GTPγS binding test
IC50
54.4±n/a nM
Citation
 Otake, NHashihayata, TMatsuda, YMasuda, SYamauchi, Y Prodrug amino acid derivative US Patent  US10689327 Publication Date 6/23/2020 
Target
Name:
Metabotropic glutamate receptor 3
Synonyms:
GPRC1C GRM3_HUMAN metabotropic glutamate 3 metabotropic glutamate 3/1c
Type:
Enzyme Catalytic Domain
Mol. Mass.:
98889.09
Organism:
Homo sapiens (Human)
Description:
metabotropic glutamate 1c 0 HUMAN::Q14832
Residue:
879
  
Inhibitor
Name:
BDBM446828
Synonyms:
(1R,2R,3R,5R,6R)-2-amino-6-fluoro-3-[(4- methylphenyl)methoxy]bicyclo[3.1.0]hexane-2.6- dicarboxylic acid | US10689327, Compound (II)-12
Type:
Small organic molecule
Emp. Form.:
C16H18FNO5
Mol. Mass.:
323.3162
SMILES:
Cc1ccc(CO[C@@H]2C[C@@H]3[C@@H]([C@@]3(F)C(O)=O)[C@]2(N)C(O)=O)cc1
: