Target
Isocitrate dehydrogenase [NADP] cytoplasmic [R132C]
Ligand
BDBM448752
Substrate
Meas. Tech.
Biochemical Assay
IC50
<5.08±n/a nM
Citation
 Lumeras Amador, WBoulet, SLBurkholder, TPCarballares Martin, SGilmour, RHahn, PJBauer, RARankovic, Z Mutant IDH1 inhibitors US Patent  US10696665 Publication Date 6/30/2020 
Target
Name:
Isocitrate dehydrogenase [NADP] cytoplasmic [R132C]
Synonyms:
IDH1 IDH1(R132C) Isocitrate dehydrogenase (IDH1)(R132C) Isocitrate dehydrogenase [NADP] cytoplasmic (IDH1) (R132C) | PICD
Type:
Enzyme Catalytic Domain
Mol. Mass.:
46607.23
Organism:
Homo sapiens (Human)
Description:
O75874[R132C]
Residue:
414
  
Inhibitor
Name:
BDBM448752
Synonyms:
(4S)-3-[2-[[(1S)-1-[4-[2-Cyclopropyl-1-(4-prop-2-enoylpiperazin-1-yl)ethyl]phenyl]ethyl]amino]pyrimidin-4-yl]-4-isopropyl-oxazolidin-2-one, Isomer 1 US10696665, Example 21
Type:
Small organic molecule
Emp. Form.:
C30H40N6O3
Mol. Mass.:
532.677
SMILES:
CC(C)[C@H]1COC(=O)N1c1ccnc(N[C@@H](C)c2ccc(cc2)C(CC2CC2)N2CCN(CC2)C(=O)C=C)n1
: