Target
Isocitrate dehydrogenase [NADP] cytoplasmic [R132C]
Ligand
BDBM50503281
Substrate
Meas. Tech.
Biochemical Assay
IC50
8.89±0.53 nM
Citation
 Lumeras Amador, WBoulet, SLBurkholder, TPCarballares Martin, SGilmour, RHahn, PJBauer, RARankovic, Z Mutant IDH1 inhibitors US Patent  US10696665 Publication Date 6/30/2020 
Target
Name:
Isocitrate dehydrogenase [NADP] cytoplasmic [R132C]
Synonyms:
IDH1 IDH1(R132C) Isocitrate dehydrogenase (IDH1)(R132C) Isocitrate dehydrogenase [NADP] cytoplasmic (IDH1) (R132C) | PICD
Type:
Enzyme Catalytic Domain
Mol. Mass.:
46607.23
Organism:
Homo sapiens (Human)
Description:
O75874[R132C]
Residue:
414
  
Inhibitor
Name:
BDBM50503281
Synonyms:
CHEMBL4586919 | US10696665, Example 25
Type:
Small organic molecule
Emp. Form.:
C27H37N7O3
Mol. Mass.:
507.6278
SMILES:
CCC(N1CCN(CC1)C(=O)C=C)c1ccc(cc1)[C@H](C)Nc1nc(N)cc(n1)N1C(=O)OCC1(C)C
: