Target
Tyrosine-protein kinase Blk
Ligand
BDBM452966
Substrate
Meas. Tech.
Kinase Selectivity Assay
IC50
5.40±n/a nM
Citation
 Zhou, XLiu, XHu, M Selective Bruton's tyrosine kinase inhibitor and use thereof US Patent  US10711006 Publication Date 7/14/2020 
Target
Name:
Tyrosine-protein kinase Blk
Synonyms:
B lymphoid tyrosine kinase BLK_HUMAN Tyrosine-protein kinase BLK (BLK) | p55-Blk
Type:
Protein
Mol. Mass.:
57711.88
Organism:
Homo sapiens (Human)
Description:
P51451
Residue:
505
  
Inhibitor
Name:
BDBM452966
Synonyms:
US10711006, Compound 15b
Type:
Small organic molecule
Emp. Form.:
C24H22FN7O2
Mol. Mass.:
459.4756
SMILES:
Nc1ncnc2n(nc(-c3ccc(Oc4ccc(F)cc4)nc3)c12)[C@@H]1CCCN(C1)C(=O)C=C
: