Target
AP2-associated protein kinase 1
Ligand
BDBM311182
Substrate
Meas. Tech.
Kinase Assay
IC50
0.690±n/a nM
Citation
 Luo, GDzierba, CDMacor, JE Biaryl kinase inhibitors US Patent  US10723734 Publication Date 7/28/2020 
Target
Name:
AP2-associated protein kinase 1
Synonyms:
AAK1 Adaptor-associated kinase 1 | KIAA1048
Type:
PROTEIN
Mol. Mass.:
103884.23
Organism:
Homo sapiens (Human)
Description:
ChEMBL_774569
Residue:
961
  
Inhibitor
Name:
BDBM311182
Synonyms:
(S)-methyl (4-(4-((2-amino-2,4-dimethylpentyl)oxy)-3-(trifluoromethoxy)phenyl)pyridin-2-yl)carbamate US10351563, Example 26 US10723734, Example 26 US9902722, Example 26
Type:
Small organic molecule
Emp. Form.:
C21H26F3N3O4
Mol. Mass.:
441.444
SMILES:
COC(=O)Nc1cc(ccn1)-c1ccc(OC[C@@](C)(N)CC(C)C)c(OC(F)(F)F)c1
: