Target
Polyunsaturated fatty acid lipoxygenase ALOX15
Ligand
BDBM50447181
Substrate
Meas. Tech.
UV-vis cuvette-based assay
IC50
>100000±n/a nM
Citation
 Maloney, DJLuci, DKJadhav, AHolman, TNadler, JLHolinstat, MTaylor-Fishwick, DSimeonov, AYasgar, AMcKenzie, S 4-((2-hydroxy-3-methoxybenzyl)amino)benzenesulfonamide derivatives as potent and selective inhibitors of 12-lipoxygenase US Patent  US10752581 Publication Date 8/25/2020 
Target
Name:
Polyunsaturated fatty acid lipoxygenase ALOX15
Synonyms:
15-Lipoxygenase-1 (15-LOX-1) Arachidonate 15-lipoxygenase LOG15 Reticulocyte 15-lipoxygenase-1 | Sphingosine 1-phosphate receptor 1 (S1P1)
Type:
Protein
Mol. Mass.:
74804.05
Organism:
Homo sapiens (Human)
Description:
Residue:
662
  
Inhibitor
Name:
BDBM50447181
Synonyms:
CHEMBL3113197 | US10752581, Compound 67
Type:
Small organic molecule
Emp. Form.:
C23H26N2O4S
Mol. Mass.:
426.529
SMILES:
COc1cccc(CNc2ccc(cc2)S(=O)(=O)Nc2cccc(c2)C(C)C)c1O
: