Target
Neprilysin
Ligand
BDBM459397
Substrate
Meas. Tech.
Enzyme Inhibition Assay
Ki
<1.000±n/a nM
Citation
 Gendron, RHughes, AD Neprilysin inhibitors US Patent  US10759813 Publication Date 9/1/2020 
Target
Name:
Neprilysin
Synonyms:
Atriopeptidase CD_antigen=CD10 EPN MME NEP_HUMAN Neutral endopeptidase | Neutral endopeptidase 24.11
Type:
Enzyme
Mol. Mass.:
85505.38
Organism:
Homo sapiens (Human)
Description:
P08473
Residue:
750
  
Inhibitor
Name:
BDBM459397
Synonyms:
US10759813, Example 18-39
Type:
Small organic molecule
Emp. Form.:
C27H23Cl2N3O5
Mol. Mass.:
540.395
SMILES:
O[C@H](C[C@H](Cc1ccc(cc1)-c1cccc(Cl)c1)NC(=O)c1cc(O)n(n1)-c1cccc(Cl)c1)C(O)=O
: