Target
Neprilysin
Ligand
BDBM459418
Substrate
Meas. Tech.
Enzyme Inhibition Assay
Ki
<1.000±n/a nM
Citation
 Gendron, RHughes, AD Neprilysin inhibitors US Patent  US10759813 Publication Date 9/1/2020 
Target
Name:
Neprilysin
Synonyms:
Atriopeptidase CD_antigen=CD10 EPN MME NEP_HUMAN Neutral endopeptidase | Neutral endopeptidase 24.11
Type:
Enzyme
Mol. Mass.:
85505.38
Organism:
Homo sapiens (Human)
Description:
P08473
Residue:
750
  
Inhibitor
Name:
BDBM459418
Synonyms:
US10759813, Example 20-2
Type:
Small organic molecule
Emp. Form.:
C20H19ClN4O4
Mol. Mass.:
414.842
SMILES:
O[C@H](C[C@@H](Cc1ccc(cc1Cl)-c1ccccc1)NC(=O)c1cnn[nH]1)C(O)=O
: