Target
Neprilysin
Ligand
BDBM459430
Substrate
Meas. Tech.
Enzyme Inhibition Assay
Ki
<1.000±n/a nM
Citation
 Gendron, RHughes, AD Neprilysin inhibitors US Patent  US10759813 Publication Date 9/1/2020 
Target
Name:
Neprilysin
Synonyms:
Atriopeptidase CD_antigen=CD10 EPN MME NEP_HUMAN Neutral endopeptidase | Neutral endopeptidase 24.11
Type:
Enzyme
Mol. Mass.:
85505.38
Organism:
Homo sapiens (Human)
Description:
P08473
Residue:
750
  
Inhibitor
Name:
BDBM459430
Synonyms:
US10759813, Example 23-2
Type:
Small organic molecule
Emp. Form.:
C25H25ClN4O5
Mol. Mass.:
496.943
SMILES:
Cc1ccc(Cl)cc1-c1ccc(C[C@@H](C[C@H](O)C(O)=O)NC(=O)c2ccc3NNN(O)c3c2)cc1
: