Target
ATR-interacting protein/Serine/threonine-protein kinase ATR
Ligand
BDBM268389
Substrate
Meas. Tech.
Binding Assay ATR (tracer A)
IC50
1000±n/a nM
Citation
 Wortmann, LLücking, ULefranc, JBriem, HKoppitz, MEis, KVon Nussbaum, FBader, BWengner, AMSiemeister, GBone, WLienau, PGrudzinska-Goebel, JMoosmayer, DEberspächer, USchick, H 2-(morpholin-4-yl)-1,7-naphthyridines US Patent  US10772893 Publication Date 9/15/2020 
Target
Name:
ATR-interacting protein/Serine/threonine-protein kinase ATR
Synonyms:
ATR/ATRIP
Type:
Enzyme
Mol. Mass.:
Description:
Components:
This complex has 2 components.
Component 1
Name:
Serine/threonine-protein kinase ATR
Synonyms:
ATR Ataxia telangiectasia and Rad3-related protein (ATR) FRP1 | Serine-protein kinase ATR
Type:
Protein
Mol. Mass.:
301404.58
Organism:
Homo sapiens (Human)
Description:
Q13535
Residue:
2644
  
Component 2
Name:
ATR-interacting protein
Synonyms:
AGS1 ATR-interacting protein (ATRIP) ATRIP_HUMAN
Type:
Enzyme Catalytic Domain
Mol. Mass.:
85833.30
Organism:
Homo sapiens (Human)
Description:
Q8WXE1
Residue:
791
  
Inhibitor
Name:
BDBM268389
Synonyms:
4-(1,1-dioxido-1-thia-6- azaspiro[3.3]hept-6-yl)-2- (morpholin-4-yl)-8-(1H-pyrazol-5- yl)-1,7-naphthyridine US11529356, Example 425 | US9549932, 425
Type:
Small organic molecule
Emp. Form.:
C20H22N6O3S
Mol. Mass.:
426.492
SMILES:
O=S1(=O)CCC11CN(C1)c1cc(nc2c(nccc12)-c1ccn[nH]1)N1CCOCC1
: