Target
Neutral amino acid transporter B(0)
Ligand
BDBM464426
Substrate
Meas. Tech.
3H-Amino Acid Uptake Assays
IC50
3300±n/a nM
Citation
 Manning, HCSchulte, M Glutamine transport inhibitors and methods for treating cancer US Patent  US10793514 Publication Date 10/6/2020 
Target
Name:
Neutral amino acid transporter B(0)
Synonyms:
AAAT_HUMAN ASCT2 Baboon M7 virus receptor Neutral amino acid transporter B(0) RDR SLC1A5 Solute carrier family 1 member 5
Type:
PROTEIN
Mol. Mass.:
56592.12
Organism:
Homo sapiens (Human)
Description:
ChEMBL_109758
Residue:
541
  
Inhibitor
Name:
BDBM464426
Synonyms:
US10793514, Compound 19
Type:
Small organic molecule
Emp. Form.:
C32H32F2N2O4
Mol. Mass.:
546.6043
SMILES:
N[C@H](CCN(Cc1ccccc1OCc1ccccc1F)Cc1ccccc1OCc1ccccc1F)C(O)=O
: