Target
Tyrosine-protein kinase JAK1
Ligand
BDBM466359
Substrate
Meas. Tech.
JAK Kinase Assays
EC50
1.000±n/a nM
Citation
 Larsen, MRitzen, ANørremark, BGreve, DR 5-(7H-pyrrolo[2,3-d]pyrimidin-4-yl)-5-azaspiro[2.5]octane-8-carboxylic acid derivatives as novel JAK kinase inhibitors US Patent  US10799507 Publication Date 10/13/2020 
Target
Name:
Tyrosine-protein kinase JAK1
Synonyms:
JAK-1 JAK1A JAK1_HUMAN Janus kinase 1 (JAK1) | Janus kinase 1 JAK1
Type:
Protein
Mol. Mass.:
133293.73
Organism:
Homo sapiens (Human)
Description:
P23458
Residue:
1154
  
Inhibitor
Name:
BDBM466359
Synonyms:
(8S)-N-[(1R)-1-(4- fluorophenyl)-2- hydroxy-ethyl]-5- (7H-pyrrolo[2,3- d]pyrimidin-4-yl)- 5-azaspiro [2.5]octane- 8-carboxamide | US10799507, Example 17
Type:
Small organic molecule
Emp. Form.:
C22H24FN5O2
Mol. Mass.:
409.4567
SMILES:
OC[C@H](NC(=O)[C@H]1CCN(CC11CC1)c1ncnc2[nH]ccc12)c1ccc(F)cc1
: