Target
Tyrosine-protein kinase JAK1
Ligand
BDBM466493
Substrate
Meas. Tech.
JAK Kinase Assays
EC50
0.500±n/a nM
Citation
 Larsen, MRitzen, ANørremark, BGreve, DR 5-(7H-pyrrolo[2,3-d]pyrimidin-4-yl)-5-azaspiro[2.5]octane-8-carboxylic acid derivatives as novel JAK kinase inhibitors US Patent  US10799507 Publication Date 10/13/2020 
Target
Name:
Tyrosine-protein kinase JAK1
Synonyms:
JAK-1 JAK1A JAK1_HUMAN Janus kinase 1 (JAK1) | Janus kinase 1 JAK1
Type:
Protein
Mol. Mass.:
133293.73
Organism:
Homo sapiens (Human)
Description:
P23458
Residue:
1154
  
Inhibitor
Name:
BDBM466493
Synonyms:
US10799507, Example 159 | [1-(Hydroxymethyl)Cyclopentyl]Methyl (8S)-5-(7H-Pyrrolo[2,3-d]Pyrimidin-4-Yl)-5-Azaspiro[2.5]Octane-8-Carboxylate
Type:
Small organic molecule
Emp. Form.:
C21H28N4O3
Mol. Mass.:
384.472
SMILES:
OCC1(COC(=O)[C@H]2CCN(CC22CC2)c2ncnc3[nH]ccc23)CCCC1
: