Target
Beta-lactamase
Ligand
BDBM466965
Substrate
Meas. Tech.
Inhibition of Beta-Lactamase Enzymes
IC50
11.0±n/a nM
Citation
 Comita-Prevoir, JDurand-Reville, TFGauthier, LO''Donnell, JRomero, JTommasi, RVerheijen, JCWu, FWu, XZhang, J Beta-lactamase inhibitor compounds US Patent  US10800778 Publication Date 10/13/2020 
Target
Name:
Beta-lactamase
Synonyms:
AMPC_ECOLI Beta-lactamase (AmpC) Cephalosporinase ampA | ampC
Type:
Protien
Mol. Mass.:
41561.62
Organism:
Escherichia coli
Description:
P00811
Residue:
377
  
Inhibitor
Name:
BDBM466965
Synonyms:
(2R)-{[(2S,5R)-2-carbamoyl-3-methyl-7-oxo-1,6-diazabicyclo[3.2.1]oct-3-en-6-yl]oxy}(fluoro)ethanoic acid lithium salt | US10800778, Example 4
Type:
Small organic molecule
Emp. Form.:
C10H12FN3O5
Mol. Mass.:
273.2178
SMILES:
CC1=C[C@@H]2CN([C@@H]1C(N)=O)C(=O)N2O[C@H](F)C(O)=O
: