Target
Beta-lactamase
Ligand
BDBM466971
Substrate
Meas. Tech.
Inhibition of Beta-Lactamase Enzymes
IC50
1.80±n/a nM
Citation
 Comita-Prevoir, JDurand-Reville, TFGauthier, LO''Donnell, JRomero, JTommasi, RVerheijen, JCWu, FWu, XZhang, J Beta-lactamase inhibitor compounds US Patent  US10800778 Publication Date 10/13/2020 
Target
Name:
Beta-lactamase
Synonyms:
AMPC_ECOLI Beta-lactamase (AmpC) Cephalosporinase ampA | ampC
Type:
Protien
Mol. Mass.:
41561.62
Organism:
Escherichia coli
Description:
P00811
Residue:
377
  
Inhibitor
Name:
BDBM466971
Synonyms:
2-fluoro-2-(((2S,5R)-3-methyl-7-oxo-2-((pyrazin-2-ylmethyl)carbamoyl)-1,6-diazabicyclo[3.2.1]oct-3-en-6-yl)oxy)acetic acid lithium salt | US10800778, Example 30
Type:
Small organic molecule
Emp. Form.:
C15H16FN5O5
Mol. Mass.:
365.3164
SMILES:
CC1=C[C@@H]2CN([C@@H]1C(=O)NCc1cnccn1)C(=O)N2OC(F)C(O)=O
: