Target
[Pyruvate dehydrogenase (acetyl-transferring)] kinase isozyme 2, mitochondrial
Ligand
BDBM467114
Substrate
Meas. Tech.
Inhibitory Action of PDHK2 Activity In Vitro
IC50
5.00±n/a nM
Citation
 Maeba, TSuzawa, KKotoku, MMasuo, RMotoda, DYamaoka, N Nitrogen-containing heterocyclic amide compound and pharmaceutical use thereof US Patent  US10800784 Publication Date 10/13/2020 
Target
Name:
[Pyruvate dehydrogenase (acetyl-transferring)] kinase isozyme 2, mitochondrial
Synonyms:
PDHK2 PDK2_HUMAN Pyruvate dehydrogenase kinase isoenzyme 1 (PDK2)
Type:
Enzyme
Mol. Mass.:
46153.78
Organism:
Homo sapiens (Human)
Description:
Q15119
Residue:
407
  
Inhibitor
Name:
BDBM467114
Synonyms:
US10800784, Example 100
Type:
Small organic molecule
Emp. Form.:
C17H19F3N4O3
Mol. Mass.:
384.353
SMILES:
C[C@H]1CN(Cc2onc(c12)[C@@](C)(O)C(F)(F)F)C(=O)c1cc2CCCn2n1
: