Target
Fibroblast growth factor receptor 2
Ligand
BDBM161404
Substrate
Meas. Tech.
Measurement of Inhibitory Effect on FGFR2 Kinase Activity
IC50
4.10±n/a nM
Citation
 Sootome, H Therapeutic agent for FGFR inhibitor-resistant cancer US Patent  US10835536 Publication Date 11/17/2020 
Target
Name:
Fibroblast growth factor receptor 2
Synonyms:
BEK FGFR-2 FGFR2 Fibroblast growth factor receptor 2 (FGFR2) KGFR Keratinocyte growth factor receptor VEGF-receptor 2 and Fibroblast growth factor receptor 2
Type:
Enzyme
Mol. Mass.:
92015.45
Organism:
Homo sapiens (Human)
Description:
P21802
Residue:
821
  
Inhibitor
Name:
BDBM161404
Synonyms:
US10124003, Ex. Compound 17 US10894048, Ex Comp 17 | US9108973, 17
Type:
Small organic molecule
Emp. Form.:
C26H31N7O3
Mol. Mass.:
489.5694
SMILES:
CCN(CC)C\C=C\C(=O)N1CC(C1)n1nc(C#Cc2cc(OC)cc(OC)c2)c2c(N)ncnc12
: