Target
Fibroblast growth factor receptor 2
Ligand
BDBM161450
Substrate
Meas. Tech.
Measurement of Inhibitory Effect on FGFR2 Kinase Activity
IC50
1.000±n/a nM
Citation
 Sootome, H Therapeutic agent for FGFR inhibitor-resistant cancer US Patent  US10835536 Publication Date 11/17/2020 
Target
Name:
Fibroblast growth factor receptor 2
Synonyms:
BEK FGFR-2 FGFR2 Fibroblast growth factor receptor 2 (FGFR2) KGFR Keratinocyte growth factor receptor VEGF-receptor 2 and Fibroblast growth factor receptor 2
Type:
Enzyme
Mol. Mass.:
92015.45
Organism:
Homo sapiens (Human)
Description:
P21802
Residue:
821
  
Inhibitor
Name:
BDBM161450
Synonyms:
US10124003, Ex. Compound 63 US10894048, Ex Comp 62 | US9108973, 63
Type:
Small organic molecule
Emp. Form.:
C27H30N6O4
Mol. Mass.:
502.5649
SMILES:
COc1cc(OC)cc(c1)C#Cc1cn(C2CN(C2)C(=O)\C=C\CN2CC[C@@H](O)C2)c2ncnc(N)c12
: