Target
Fibroblast growth factor receptor 2
Ligand
BDBM161465
Substrate
Meas. Tech.
Measurement of Inhibitory Effect on FGFR2 Kinase Activity
IC50
110±n/a nM
Citation
 Sootome, H Therapeutic agent for FGFR inhibitor-resistant cancer US Patent  US10835536 Publication Date 11/17/2020 
Target
Name:
Fibroblast growth factor receptor 2
Synonyms:
BEK FGFR-2 FGFR2 Fibroblast growth factor receptor 2 (FGFR2) KGFR Keratinocyte growth factor receptor VEGF-receptor 2 and Fibroblast growth factor receptor 2
Type:
Enzyme
Mol. Mass.:
92015.45
Organism:
Homo sapiens (Human)
Description:
P21802
Residue:
821
  
Inhibitor
Name:
BDBM161465
Synonyms:
US10124003, Ref. Ex. Compound 6 US10894048, Ref. Ex Comp. 6 | US9108973, Ref 6
Type:
Small organic molecule
Emp. Form.:
C25H28N8O2
Mol. Mass.:
472.5422
SMILES:
CN(C)C\C=C\C(=O)N1CC[C@@H](C1)n1nc(C#Cc2cccc(NC(C)=O)c2)c2c(N)ncnc12
: