Target
Tyrosine-protein kinase BTK
Ligand
BDBM473173
Substrate
Meas. Tech.
Kinase Assay
Kd
52±n/a nM
Citation
 Mansour, TSEvans, CE 1,2-dithiolane compounds useful in neuroprotection, autoimmune and cancer diseases and conditions US Patent  US10844038 Publication Date 11/24/2020 
Target
Name:
Tyrosine-protein kinase BTK
Synonyms:
AGMX1 Agammaglobulinaemia tyrosine kinase B cell progenitor kinase BPK BTK_HUMAN Tyrosine Kinase BTK Tyrosine-protein kinase BTK (BTK)
Type:
Enzyme
Mol. Mass.:
76289.95
Organism:
Homo sapiens (Human)
Description:
Q06187
Residue:
659
  
Inhibitor
Name:
BDBM473173
Synonyms:
US10844038, Example 42 trans 3-((4-Amino-3-(4-phenoxyphenyl)-1H-pyrazolo[3,4-d]pyrimidin-1-yl)methyl)-1,2-dithiolan-4-ol
Type:
Small organic molecule
Emp. Form.:
C21H19N5O2S2
Mol. Mass.:
437.538
SMILES:
Nc1ncnc2n(CC3SSCC3O)nc(-c3ccc(Oc4ccccc4)cc3)c12
: