Target
Induced myeloid leukemia cell differentiation protein Mcl-1
Ligand
BDBM50158091
Substrate
Meas. Tech.
fluorescence polarization competition assay (FPCA)
Ki
21000±3900 nM
Citation
 Fletcher, SLanning, MChen, L Small molecule inhibitors of the MCL-1 oncoprotein and uses thereof US Patent  US10858316 Publication Date 12/8/2020 
Target
Name:
Induced myeloid leukemia cell differentiation protein Mcl-1
Synonyms:
BCL2L3 Bcl-2-like protein 3 (Mcl-1) Bcl2-L-3 MCL1 Mcl-1 Myeloid cell leukemia sequence 1 (BCL2-related) | mcl1/EAT
Type:
Membrane; Single-pass membrane protein
Mol. Mass.:
37332.87
Organism:
Homo sapiens (Human)
Description:
Q07820
Residue:
350
  
Inhibitor
Name:
BDBM50158091
Synonyms:
CHEMBL3780331 | US10858316, Compound 3f
Type:
Small organic molecule
Emp. Form.:
C18H14ClNO5S
Mol. Mass.:
391.825
SMILES:
OC(=O)c1cc(c2ccccc2c1O)S(=O)(=O)NCc1ccc(Cl)cc1
: