Target
Isoform Bcl-X(L) of Bcl-2-like protein 1 (Bcl-xL)
Ligand
BDBM50158091
Substrate
Meas. Tech.
fluorescence polarization competition assay (FPCA)
Ki
338000±203000 nM
Citation
 Fletcher, SLanning, MChen, L Small molecule inhibitors of the MCL-1 oncoprotein and uses thereof US Patent  US10858316 Publication Date 12/8/2020 
Target
Name:
Isoform Bcl-X(L) of Bcl-2-like protein 1 (Bcl-xL)
Synonyms:
B-cell lymphoma-extra large protein (Bcl-xL) BCL-xL BCL2L1 Bcl-2-like protein 1 (Bcl-xL) | Isoform Bcl-X(L)
Type:
Homodimers/heterodimers with BAX, BAK and BCL2
Mol. Mass.:
26053.63
Organism:
Homo sapiens (Human)
Description:
gi_510901
Residue:
233
  
Inhibitor
Name:
BDBM50158091
Synonyms:
CHEMBL3780331 | US10858316, Compound 3f
Type:
Small organic molecule
Emp. Form.:
C18H14ClNO5S
Mol. Mass.:
391.825
SMILES:
OC(=O)c1cc(c2ccccc2c1O)S(=O)(=O)NCc1ccc(Cl)cc1
: