Target
Phosphatidylinositol 4,5-bisphosphate 3-kinase catalytic subunit gamma isoform
Ligand
BDBM473999
Substrate
Meas. Tech.
Enzymatic Activity Assay for Rec Human PI3Kgamma
IC50
0.794±n/a nM
Citation
 Mogemark, MPemberton, NPetersen, JPerry, MKarabelas, KZlatoidsky, PCox, RTyrchan, C Inhibitors of phosphatidylinositol 3-kinase gamma US Patent  US10858355 Publication Date 12/8/2020 
Target
Name:
Phosphatidylinositol 4,5-bisphosphate 3-kinase catalytic subunit gamma isoform
Synonyms:
PI3-kinase p110 subunit gamma PI3Kgamma PK3CG_HUMAN Phosphatidylinositol 4,5-bisphosphate 3-kinase (PI3K) Phosphatidylinositol 4,5-bisphosphate 3-kinase catalytic subunit gamma (PI3Kgamma) Phosphatidylinositol 4,5-bisphosphate 3-kinase catalytic subunit gamma isoform (PI3K) Phosphatidylinositol-4,5-bisphosphate 3-kinase catalytic subunit gamma isoform Phosphoinositide 3-kinases gamma (PI3K gamma) p120-PI3K
Type:
Enzyme Subunit
Mol. Mass.:
126470.30
Organism:
Homo sapiens (Human)
Description:
P48736
Residue:
1102
  
Inhibitor
Name:
BDBM473999
Synonyms:
N-(5-{2-[(1S)-1-Cyclopropylethyl]-7-(dimethylsulfamoyl)-1-oxo-2,3-dihydro-1H-isoindol-5-yl}-4-methyl-1,3-thiazol-2-yl)acetamide | US10858355, Example 7
Type:
Small organic molecule
Emp. Form.:
C21H26N4O4S2
Mol. Mass.:
462.586
SMILES:
C[C@@H](C1CC1)N1Cc2cc(cc(c2C1=O)S(=O)(=O)N(C)C)-c1sc(NC(C)=O)nc1C
: