Target
Malignant T-cell-amplified sequence 1
Ligand
BDBM476276
Substrate
Meas. Tech.
Biological Activity of Selected Compounds of the Invention
EC50
<100.0±n/a nM
Citation
 Bannister, TDWang, HWang, CCleveland, JL Pteridine dione monocarboxylate transporter inhibitors US Patent  US10874675 Publication Date 12/29/2020 
Target
Name:
Malignant T-cell-amplified sequence 1
Synonyms:
MCT-1 MCTS1 Multiple copies T-cell malignancies
Type:
Enzyme Catalytic Domain
Mol. Mass.:
20563.62
Organism:
Homo sapiens (human)
Description:
Residue:
181
  
Inhibitor
Name:
BDBM476276
Synonyms:
US10874675, Example 15
Type:
Small organic molecule
Emp. Form.:
C23H30N4O4
Mol. Mass.:
426.5087
SMILES:
CC(C)Cn1c2nc(COc3ccccc3)c(CCCCCO)nc2c(=O)n(C)c1=O
: