Target
Replicase polyprotein 1ab
Ligand
BDBM420297
Substrate
Meas. Tech.
fluorescence resonance energy transfer (FRET)-based CoV-2 3CLpro inhibition assay
IC50
23±3.00 nM
Citation
 Vankadara, SWong, YXLiu, BSee, YYTan, LHTan, QWWang, GKaruna, RGuo, XTan, STFong, JYJoy, JChia, CSB A head-to-head comparison of the inhibitory activities of 15 peptidomimetic SARS-CoV-2 3CLpro inhibitors. Bioorg Med Chem Lett 48:128263 (2021)  
Target
Name:
Replicase polyprotein 1ab
Synonyms:
ORF1ab polyprotein pp1ab | rep
Type:
Protein
Mol. Mass.:
794070.71
Organism:
2019-nCoV
Description:
P0DTD1
Residue:
7096
  
Inhibitor
Name:
BDBM420297
Synonyms:
acs.jmedchem.1c00409_ST.30 peptidomimetic aldehydes 11b | peptidomimetic coronavirus 3CLpro inhibitors 11b
Type:
Small organic molecule
Emp. Form.:
C25H25FN4O4
Mol. Mass.:
464.4888
SMILES:
Fc1cccc(C[C@H](NC(=O)c2cc3ccccc3[nH]2)C(=O)N[C@@H](C[C@@H]2CCNC2=O)C=O)c1
: