Target
Replicase polyprotein 1ab
Ligand
BDBM50084655
Substrate
Meas. Tech.
Literature assay
IC50
10690±280 nM
Citation
 Vankadara, SWong, YXLiu, BSee, YYTan, LHTan, QWWang, GKaruna, RGuo, XTan, STFong, JYJoy, JChia, CSB A head-to-head comparison of the inhibitory activities of 15 peptidomimetic SARS-CoV-2 3CLpro inhibitors. Bioorg Med Chem Lett 48:128263 (2021)  
Target
Name:
Replicase polyprotein 1ab
Synonyms:
ORF1ab polyprotein pp1ab | rep
Type:
Protein
Mol. Mass.:
794070.71
Organism:
2019-nCoV
Description:
P0DTD1
Residue:
7096
  
Inhibitor
Name:
BDBM50084655
Synonyms:
CHEMBL92708 Z-Leu-Nle-CHO [1-((S)-(S)-1-Formyl-pentylcarbamoyl)-3-methyl-butyl]-carbamic acid benzyl ester [1-(1-Formyl-pentylcarbamoyl)-3-methyl-butyl]-carbamic acid benzyl ester(calpeptin) | benzyl (S)-4-methyl-1-oxo-1-((S)-1-oxohexan-2-ylamino)pentan-2-ylcarbamate
Type:
Small organic molecule
Emp. Form.:
C20H30N2O4
Mol. Mass.:
362.4632
SMILES:
CCCC[C@H](NC(=O)[C@H](CC(C)C)NC(=O)OCc1ccccc1)C=O
: