Target
Replicase polyprotein 1ab
Ligand
BDBM50326056
Substrate
Meas. Tech.
Literature assay
IC50
11470±n/a nM
Citation
 Vankadara, SWong, YXLiu, BSee, YYTan, LHTan, QWWang, GKaruna, RGuo, XTan, STFong, JYJoy, JChia, CSB A head-to-head comparison of the inhibitory activities of 15 peptidomimetic SARS-CoV-2 3CLpro inhibitors. Bioorg Med Chem Lett 48:128263 (2021)  
Target
Name:
Replicase polyprotein 1ab
Synonyms:
ORF1ab polyprotein pp1ab | rep
Type:
Protein
Mol. Mass.:
794070.71
Organism:
2019-nCoV
Description:
P0DTD1
Residue:
7096
  
Inhibitor
Name:
BDBM50326056
Synonyms:
(1S,3aR,6aS)-2-((S)-2-((S)-2-cyclohexyl-2-(pyrazine-2-carboxamido)acetamido)-3,3-dimethylbutanoyl)-N-((S)-1-(cyclopropylamino)-1,2-dioxohexan-3-yl)octahydrocyclopenta[c]pyrrole-1-carboxamide (1S,3aR,6aS)-2-((S)-2-((S)-2-cyclohexyl-2-(pyrazine-6-carboxamido)acetamido)-3,3-dimethylbutanoyl)-N-((S)-1-(cyclopropylamino)-1,2-dioxohexan-3-yl)-octahydrocyclopenta[c]pyrrole-1-carboxamide TELAPREVIR VX-950
Type:
Small organic molecule
Emp. Form.:
C36H53N7O6
Mol. Mass.:
679.8493
SMILES:
CCC[C@H](NC(=O)[C@@H]1[C@H]2CCC[C@H]2CN1C(=O)[C@@H](NC(=O)[C@@H](NC(=O)c1cnccn1)C1CCCCC1)C(C)(C)C)C(=O)C(=O)NC1CC1
: