Target
Proto-oncogene tyrosine-protein kinase receptor Ret
Ligand
BDBM305035
Substrate
Meas. Tech.
Enzyme Assay
IC50
113±n/a nM
Citation
 Andrews, SWAronow, SBlake, JFBrandhuber, BJCollier, JCook, AHaas, JJiang, YKolakowski, GRMcFaddin, EAMcKenney, MLMcNulty, OTMetcalf, ATMoreno, DARamann, GATang, TPRen, LWalls, SM Substituted pyrazolo[1,5-A]pyridine compounds as RET kinase inhibitors US Patent  US10881652 Publication Date 1/5/2021 
Target
Name:
Proto-oncogene tyrosine-protein kinase receptor Ret
Synonyms:
CDHF12 Cadherin family member 12 Proto-oncogene c-Ret RET51 Tyrosine-protein kinase Ret (RET)
Type:
Protein
Mol. Mass.:
124318.29
Organism:
Homo sapiens (Human)
Description:
P07949
Residue:
1114
  
Inhibitor
Name:
BDBM305035
Synonyms:
US10144734, Example 51 US10441581, Example 51 US11648243, Example 51
Type:
Small organic molecule
Emp. Form.:
C30H34N6O2
Mol. Mass.:
510.63
SMILES:
CC(C)(O)COc1cc(-c2ccc(nc2)N2CCC(C)(CC2)NCc2ccccc2)c2c(cnn2c1)C#N
: