Target
Proto-oncogene tyrosine-protein kinase receptor Ret
Ligand
BDBM305731
Substrate
Meas. Tech.
Enzyme Assay
IC50
25.0±n/a nM
Citation
 Andrews, SWAronow, SBlake, JFBrandhuber, BJCollier, JCook, AHaas, JJiang, YKolakowski, GRMcFaddin, EAMcKenney, MLMcNulty, OTMetcalf, ATMoreno, DARamann, GATang, TPRen, LWalls, SM Substituted pyrazolo[1,5-A]pyridine compounds as RET kinase inhibitors US Patent  US10881652 Publication Date 1/5/2021 
Target
Name:
Proto-oncogene tyrosine-protein kinase receptor Ret
Synonyms:
CDHF12 Cadherin family member 12 Proto-oncogene c-Ret RET51 Tyrosine-protein kinase Ret (RET)
Type:
Protein
Mol. Mass.:
124318.29
Organism:
Homo sapiens (Human)
Description:
P07949
Residue:
1114
  
Inhibitor
Name:
BDBM305731
Synonyms:
6-(2-hydroxy-2- methylpropoxy)-4-(6-(4- hydroxy-4-(2- methylbenzyl)piperidin- 1-yl)pyridin-3-yl) pyrazolo[1,5-a]pyridine- 3-carbonitrile US10172845, Example 749 US10881652, Example 749 | US11648243, Example 749
Type:
Small organic molecule
Emp. Form.:
C30H33N5O3
Mol. Mass.:
511.6147
SMILES:
Cc1ccccc1CC1(O)CCN(CC1)c1ccc(cn1)-c1cc(OCC(C)(C)O)cn2ncc(C#N)c12
: