Target
Tyrosine-protein kinase JAK1
Ligand
BDBM477065
Substrate
Meas. Tech.
Biochemical Assay
Kd
2.70±n/a nM
Citation
 Fyfe, MC Kinase inhibitors US Patent  US10882859 Publication Date 1/5/2021 
Target
Name:
Tyrosine-protein kinase JAK1
Synonyms:
JAK-1 JAK1A JAK1_HUMAN Janus kinase 1 (JAK1) | Janus kinase 1 JAK1
Type:
Protein
Mol. Mass.:
133293.73
Organism:
Homo sapiens (Human)
Description:
P23458
Residue:
1154
  
Inhibitor
Name:
BDBM477065
Synonyms:
US10882859, Reference compound PF-06263276
Type:
Small organic molecule
Emp. Form.:
C31H31FN8O2
Mol. Mass.:
566.6286
SMILES:
CCc1cc(O)c(F)cc1-c1ccc2c(n[nH]c2c1)-c1nc2CCN(Cc2[nH]1)C(=O)c1cnc(cn1)N1CCCCC1
: